Reaction Details
TargetArachidonate 15-lipoxygenase
LigandBDBM190651
Substrate/Competitorn/a
Meas. Tech.LoxA Selectivity Assay
pH7±n/a
Temperature298.15±n/a K
IC50 1.0e+3± 2e+2 nM
Commentsextracted
Citation Deschamps, JDOgunsola, AFJameson, JBYasgar, AFlitter, BAFreedman, CJMelvin, JANguyen, JVMaloney, DJJadhav, ASimeonov, ABomberger, JMHolman, TR Biochemical and Cellular Characterization and Inhibitor Discovery of Pseudomonas aeruginosa 15-Lipoxygenase. Biochemistry55:3329-40 (2016) 
 
Arachidonate 15-lipoxygenase
Name:Arachidonate 15-lipoxygenase
Synonyms:15-Lipoxygenase (LoxA)
Type:Protein
Mol. Mass.:74804.41
Organism:Pseudomonas aeruginosa
Description:n/a
Residue:685
BDBM190651
NameBDBM190651
TypeSmall organic molecule
Emp. Form.C18H21FO2
Mol. Mass.288.3565
SMILESCCCCCCc1ccc(Oc2ccccc2F)c(O)c1