Reaction Details
TargetBeta-secretase 2
LigandBDBM190773
Substrate/Competitorn/a
Meas. Tech.HTRF FRET Assay
pH5±n/a
Temperature303.15±n/a K
Ki 0.9±n/a nM
Commentsextracted
Citation Wu, WBurnett, DAStamford, AWCumming, JNAsberom, TBennett, CSasiskumar, TKScott, JD 2-spiro-substituted iminothiazines and their mono-and dioxides as bace inhibitors, compositions and their use US Patent US9181236 Publication Date 11/10/2015
 
Beta-secretase 2
Name:Beta-secretase 2
Type:Protein
Mol. Mass.:56171.20
Organism:Homo sapiens (Human)
Description:Q9Y5Z0
Residue:518
BDBM190773
NameBDBM190773
Synonyms:US9181236, 62g
TypeSmall organic molecule
Emp. Form.C21H22ClN3O4S2
Mol. Mass.480
SMILESCOc1cccc2cc([nH]c12)-c1cc(Cl)c(s1)[C@]1(C)CS(=O)(=O)[C@]2(CCOC2)C(=N)N1