Reaction Details
TargetBeta-secretase 2
LigandBDBM190784
Substrate/Competitorn/a
Meas. Tech.HTRF FRET Assay
pH5±n/a
Temperature303.15±n/a K
Ki 1.3±n/a nM
Commentsextracted
Citation Wu, WBurnett, DAStamford, AWCumming, JNAsberom, TBennett, CSasiskumar, TKScott, JD 2-spiro-substituted iminothiazines and their mono-and dioxides as bace inhibitors, compositions and their use US Patent US9181236 Publication Date 11/10/2015
 
Beta-secretase 2
Name:Beta-secretase 2
Type:Protein
Mol. Mass.:56171.20
Organism:Homo sapiens (Human)
Description:Q9Y5Z0
Residue:518
BDBM190784
NameBDBM190784
Synonyms:US9181236, 63c
TypeSmall organic molecule
Emp. Form.C20H20ClFN4O4S
Mol. Mass.466.914
SMILESC[C@]1(CS(=O)(=O)[C@@]2(CCOC2)C(=N)N1)c1cc(NC(=O)c2ccc(Cl)cn2)ccc1F