Reaction Details
TargetSerine/threonine-protein kinase pim-1
LigandBDBM191075
Substrate/Competitorn/a
Meas. Tech.Trans-Phosphorylation Assay
pH7.5±n/a
IC50 4±n/a nM
Commentsextracted
Citation Casuscelli, FBadari, AOrrenius, SCPiutti, CDisingrini, T Substituted 3,4-dihydropyrrolo[1,2-a]pyrazin-1(2H)-ones as protein kinase inhibitors US Patent US9181258 Publication Date 11/10/2015
 
Serine/threonine-protein kinase pim-1
Name:Serine/threonine-protein kinase pim-1
Type:Protein
Mol. Mass.:35681.82
Organism:Homo sapiens (Human)
Description:P11309
Residue:313
BDBM191075
NameBDBM191075
Synonyms:US9181258, 83
TypeSmall organic molecule
Emp. Form.C27H25F6N3O4
Mol. Mass.569.4955
SMILESCN(C)Cc1ccc(cc1)-c1c(cc2C(=O)NCC(CCOC(=O)C(F)(F)F)n12)-c1cccc(OC(F)(F)F)c1