Reaction Details
TargetSerine/threonine-protein kinase pim-1
LigandBDBM191104
Substrate/Competitorn/a
Meas. Tech.Trans-Phosphorylation Assay
pH7.5±n/a
IC50 1±n/a nM
Commentsextracted
Citation Casuscelli, FBadari, AOrrenius, SCPiutti, CDisingrini, T Substituted 3,4-dihydropyrrolo[1,2-a]pyrazin-1(2H)-ones as protein kinase inhibitors US Patent US9181258 Publication Date 11/10/2015
 
Serine/threonine-protein kinase pim-1
Name:Serine/threonine-protein kinase pim-1
Type:Protein
Mol. Mass.:35681.82
Organism:Homo sapiens (Human)
Description:P11309
Residue:313
BDBM191104
NameBDBM191104
Synonyms:US9181258, 101
TypeSmall organic molecule
Emp. Form.C25H27F3N4O2
Mol. Mass.472.5027
SMILESCN(C)Cc1ccc(cc1)-c1c(cc2C(=O)NC[C@H](CCN)n12)-c1cccc(OC(F)(F)F)c1