Reaction Details
TargetSerine/threonine-protein kinase pim-1
LigandBDBM191117
Substrate/Competitorn/a
Meas. Tech.Trans-Phosphorylation Assay
pH7.5±n/a
IC50 6±n/a nM
Commentsextracted
Citation Casuscelli, FBadari, AOrrenius, SCPiutti, CDisingrini, T Substituted 3,4-dihydropyrrolo[1,2-a]pyrazin-1(2H)-ones as protein kinase inhibitors US Patent US9181258 Publication Date 11/10/2015
 
Serine/threonine-protein kinase pim-1
Name:Serine/threonine-protein kinase pim-1
Type:Protein
Mol. Mass.:35681.82
Organism:Homo sapiens (Human)
Description:P11309
Residue:313
BDBM191117
NameBDBM191117
Synonyms:US9181258, 112
TypeSmall organic molecule
Emp. Form.C23H20F3N3O4
Mol. Mass.459.4178
SMILESNCC[C@H]1CNC(=O)c2cc(c(-c3ccc4OCOc4c3)n12)-c1cccc(OC(F)(F)F)c1