Reaction Details
TargetSerine/threonine-protein kinase pim-2
LigandBDBM191103
Substrate/Competitorn/a
Meas. Tech.Trans-Phosphorylation Assay
pH7.5±n/a
IC50 2±n/a nM
Commentsextracted
Citation Casuscelli, FBadari, AOrrenius, SCPiutti, CDisingrini, T Substituted 3,4-dihydropyrrolo[1,2-a]pyrazin-1(2H)-ones as protein kinase inhibitors US Patent US9181258 Publication Date 11/10/2015
 
Serine/threonine-protein kinase pim-2
Name:Serine/threonine-protein kinase pim-2
Type:Serine/threonine-protein kinase
Mol. Mass.:34185.93
Organism:Homo sapiens (Human)
Description:Q9P1W9
Residue:311
BDBM191103
NameBDBM191103
Synonyms:US9181258, 100
TypeSmall organic molecule
Emp. Form.C28H32F3N5O2
Mol. Mass.527.5812
SMILESCN1CCN(Cc2ccc(cc2)-c2c(cc3C(=O)NC[C@H](CCN)n23)-c2cccc(OC(F)(F)F)c2)CC1