Reaction Details
TargetHigh affinity nerve growth factor receptor
LigandBDBM50446393
Substrate/Competitorn/a
Meas. Tech.Kinase Activity Assay
Temperature298.15±n/a K
EC50 1005±n/a nM
Commentsextracted
Citation Stachel, SJEgbertson, MBrnardic, EJones, KGSanders, JMHenze, D TrkA kinase inhibitors, compositions and methods thereof US Patent US9181261 Publication Date 11/10/2015
 
High affinity nerve growth factor receptor
Name:High affinity nerve growth factor receptor
Type:n/a
Mol. Mass.:87498.18
Organism:Homo sapiens (Human)
Description:P04629
Residue:796
BDBM50446393
NameBDBM50446393
Synonyms:CHEMBL3109644 | US9181261, 74
TypeSmall organic molecule
Emp. Form.C22H20F3N3O2S
Mol. Mass.447.473
SMILESCC1(C)CN(C(=O)N1Cc1cccc(c1)-c1nccs1)c1ccc(OC(F)(F)F)cc1