Reaction Details
TargetHigh affinity nerve growth factor receptor
LigandBDBM191140
Substrate/Competitorn/a
Meas. Tech.Kinase Activity Assay
Temperature298.15±n/a K
EC50 8084±n/a nM
Commentsextracted
Citation Stachel, SJEgbertson, MBrnardic, EJones, KGSanders, JMHenze, D TrkA kinase inhibitors, compositions and methods thereof US Patent US9181261 Publication Date 11/10/2015
 
High affinity nerve growth factor receptor
Name:High affinity nerve growth factor receptor
Type:n/a
Mol. Mass.:87498.18
Organism:Homo sapiens (Human)
Description:P04629
Residue:796
BDBM191140
NameBDBM191140
Synonyms:US9181261, 152
TypeSmall organic molecule
Emp. Form.C20H19F3N4O2S
Mol. Mass.436.451
SMILESCC(C)N(Cc1cc(ccn1)-c1nccs1)C(=O)Nc1ccc(OC(F)(F)F)cc1