Reaction Details
TargetPoly [ADP-ribose] polymerase tankyrase-1
LigandBDBM191194
Substrate/Competitorn/a
Meas. Tech.Biochemical Assay
Temperature298.15±n/a K
IC50 10±1.4 nM
Commentsextracted
Citation Cheung, AKChin, DNFan, JMiller-Moslin, KMShultz, MDSmith, TDTomlinson, RCToure, BVisser, MSChen, Z 2-piperidin-1-yl-acetamide compounds for use as tankyrase inhibitors US Patent US9181266 Publication Date 11/10/2015
 
Poly [ADP-ribose] polymerase tankyrase-1
Name:Poly [ADP-ribose] polymerase tankyrase-1
Type:Enzyme
Mol. Mass.:142058.03
Organism:Homo sapiens (Human)
Description:O95271
Residue:1327
BDBM191194
NameBDBM191194
Synonyms:US9181266, 63
TypeSmall organic molecule
Emp. Form.C28H34N4O5
Mol. Mass.506.5934
SMILESCOc1ccc2C(=O)C3(Cc2c1)CCN(CC(=O)N(CC1CC1)Cc1nc2CCOCc2c(=O)[nH]1)CC3