Reaction Details
TargetSerine/threonine-protein kinase BRSK1
LigandBDBM191572
Substrate/Competitorn/a
Meas. Tech.Radiometric-Based Assay (Epiblastin A)
IC50 2.42e+4± 5.8e+3 nM
Citation Ursu, AIllich, DJTakemoto, YPorfetye, ATZhang, MBrockmeyer, AJanning, PWatanabe, NOsada, HVetter, IRZiegler, SSchöler, HRWaldmann, H Epiblastin A Induces Reprogramming of Epiblast Stem Cells Into Embryonic Stem Cells by Inhibition of Casein Kinase 1. Cell Chem Biol23:494-507 (2016) 
 
Serine/threonine-protein kinase BRSK1
Name:Serine/threonine-protein kinase BRSK1
Type:Enzyme Catalytic Domain
Mol. Mass.:85119.02
Organism:Homo sapiens (Human)
Description:gi_24308326
Residue:778
BDBM191572
NameBDBM191572
Synonyms:6-(3-chlorophenyl)pteridine-2,4,7-triamine (15) | Epiblastin A
TypeSmall organic molecule
Emp. Form.C12H10ClN7
Mol. Mass.287.708
SMILESNc1nc(N)c2nc(c(N)nc2n1)-c1cccc(Cl)c1