Reaction Details
TargetLysine-specific demethylase 5B [1-755]
LigandBDBM50396019
Substrate/Competitorn/a
Meas. Tech.Formaldehyde Dehydrogenase-Coupled Demethylase (FDH) Assay
Temperature298.15±n/a K
IC50 5.5e+3± 7e+2 nM
Commentsextracted
Citation Horton, JRLiu, XGale, MWu, LShanks, JRZhang, XWebber, PJBell, JSKales, SCMott, BTRai, GJansen, DJHenderson, MJUrban, DJHall, MDSimeonov, AMaloney, DJJohns, MAFu, HJadhav, AVertino, PMYan, QCheng, X Structural Basis for KDM5A Histone Lysine Demethylase Inhibition by Diverse Compounds. Cell Chem Biol23:769-81 (2016) 
 
Lysine-specific demethylase 5B [1-755]
Name:Lysine-specific demethylase 5B [1-755]
Type:Protein
Mol. Mass.:86559.22
Organism:Homo sapiens (Human)
Description:Truncation 1-755 aa. Contains deletion of ARID and PhD1 domains.
Residue:755
BDBM50396019
NameBDBM50396019
Synonyms:4'-(phenethylcarbamoyl)-[2,2'-bipyridine]-4-carboxylic acid (N3) | CHEMBL2169917
TypeSmall organic molecule
Emp. Form.C20H17N3O3
Mol. Mass.347.3673
SMILESOC(=O)c1ccnc(c1)-c1cc(ccn1)C(=O)NCCc1ccccc1