Reaction Details
TargetLysine-specific demethylase 5C [1-789]
LigandBDBM191596
Substrate/Competitorn/a
Meas. Tech.Formaldehyde Dehydrogenase-Coupled Demethylase (FDH) Assay
Temperature298.15±n/a K
IC50 6e+3± 2e+3 nM
Commentsextracted
Citation Horton, JRLiu, XGale, MWu, LShanks, JRZhang, XWebber, PJBell, JSKales, SCMott, BTRai, GJansen, DJHenderson, MJUrban, DJHall, MDSimeonov, AMaloney, DJJohns, MAFu, HJadhav, AVertino, PMYan, QCheng, X Structural Basis for KDM5A Histone Lysine Demethylase Inhibition by Diverse Compounds. Cell Chem Biol23:769-81 (2016) 
 
Lysine-specific demethylase 5C [1-789]
Name:Lysine-specific demethylase 5C [1-789]
Type:Protein
Mol. Mass.:90972.72
Organism:Homo sapiens (Human)
Description:Truncation 1-789 aa. Contains deletion of ARID and PhD1 domains.
Residue:789
BDBM191596
NameBDBM191596
Synonyms:6-isopropyl-5-methyl-7-oxo-4,7-dihydropyrazolo[1,5-a]pyrimidine-3-carbonitrile (N8)
TypeSmall organic molecule
Emp. Form.C11H12N4O
Mol. Mass.216.2392
SMILESCC(C)c1c(C)[nH]c2c(cnn2c1=O)C#N