Reaction Details
TargetLysine-specific demethylase 5B [1-755]
LigandBDBM191604
Substrate/Competitorn/a
Meas. Tech.Formaldehyde Dehydrogenase-Coupled Demethylase (FDH) Assay
Temperature298.15±n/a K
IC50>3.2e+4±n/a nM
Commentsextracted
Citation Horton, JRLiu, XGale, MWu, LShanks, JRZhang, XWebber, PJBell, JSKales, SCMott, BTRai, GJansen, DJHenderson, MJUrban, DJHall, MDSimeonov, AMaloney, DJJohns, MAFu, HJadhav, AVertino, PMYan, QCheng, X Structural Basis for KDM5A Histone Lysine Demethylase Inhibition by Diverse Compounds. Cell Chem Biol23:769-81 (2016) 
 
Lysine-specific demethylase 5B [1-755]
Name:Lysine-specific demethylase 5B [1-755]
Type:Protein
Mol. Mass.:86559.22
Organism:Homo sapiens (Human)
Description:Truncation 1-755 aa. Contains deletion of ARID and PhD1 domains.
Residue:755
BDBM191604
NameBDBM191604
Synonyms:8-(1-methyl-1Himidazol-4-yl)-2-(4,4,4-trifluorobutoxy)pyrido[3,4-d]pyrimidin-4-ol (N10)
TypeSmall organic molecule
Emp. Form.C15H14F3N5O2
Mol. Mass.353.2992
SMILESCn1cnc(c1)-c1nccc2c(O)nc(OCCCC(F)(F)F)nc12