Reaction Details
TargetLysine-specific demethylase 5C [1-789]
LigandBDBM191597
Substrate/Competitorn/a
Meas. Tech.Formaldehyde Dehydrogenase-Coupled Demethylase (FDH) Assay
Temperature298.15±n/a K
IC50 1.4e+3± 2e+2 nM
Commentsextracted
Citation Horton, JRLiu, XGale, MWu, LShanks, JRZhang, XWebber, PJBell, JSKales, SCMott, BTRai, GJansen, DJHenderson, MJUrban, DJHall, MDSimeonov, AMaloney, DJJohns, MAFu, HJadhav, AVertino, PMYan, QCheng, X Structural Basis for KDM5A Histone Lysine Demethylase Inhibition by Diverse Compounds. Cell Chem Biol23:769-81 (2016) 
 
Lysine-specific demethylase 5C [1-789]
Name:Lysine-specific demethylase 5C [1-789]
Type:Protein
Mol. Mass.:90972.72
Organism:Homo sapiens (Human)
Description:Truncation 1-789 aa. Contains deletion of ARID and PhD1 domains.
Residue:789
BDBM191597
NameBDBM191597
Synonyms:3-((1-(2-(4,4-difluoropiperidin-1-yl)ethyl)-5-fluoro-1H-indazol-3-yl)amino)-isonicotinic acid (N11) US10336727, Example 73 | US9617242, Example 73
TypeSmall organic molecule
Emp. Form.C20H20F3N5O2
Mol. Mass.419.4003
SMILESOC(=O)c1ccncc1Nc1nn(CCN2CCC(F)(F)CC2)c2ccc(F)cc12