Reaction Details
TargetLysine-specific demethylase 5A [1-588]
LigandBDBM191596
Substrate/Competitorn/a
Meas. Tech.Isothermal Titration Calorimetry (ITC)
Kd 27± 6 nM
Citation Horton, JRLiu, XGale, MWu, LShanks, JRZhang, XWebber, PJBell, JSKales, SCMott, BTRai, GJansen, DJHenderson, MJUrban, DJHall, MDSimeonov, AMaloney, DJJohns, MAFu, HJadhav, AVertino, PMYan, QCheng, X Structural Basis for KDM5A Histone Lysine Demethylase Inhibition by Diverse Compounds. Cell Chem Biol23:769-81 (2016) 
 
Lysine-specific demethylase 5A [1-588]
Name:Lysine-specific demethylase 5A [1-588]
Type:Protein
Mol. Mass.:66955.44
Organism:Homo sapiens (Human)
Description:Truncation 1-588 aa. Contains deletion of ARID and PhD1 domains.
Residue:588
BDBM191596
NameBDBM191596
Synonyms:6-isopropyl-5-methyl-7-oxo-4,7-dihydropyrazolo[1,5-a]pyrimidine-3-carbonitrile (N8)
TypeSmall organic molecule
Emp. Form.C11H12N4O
Mol. Mass.216.2392
SMILESCC(C)c1c(C)[nH]c2c(cnn2c1=O)C#N