Reaction Details
TargetLysine-specific demethylase 5A [1-588]
LigandBDBM191599
Substrate/Competitorn/a
Meas. Tech.Isothermal Titration Calorimetry (ITC)
Kd>1.0e+4±n/a nM
Citation Horton, JRLiu, XGale, MWu, LShanks, JRZhang, XWebber, PJBell, JSKales, SCMott, BTRai, GJansen, DJHenderson, MJUrban, DJHall, MDSimeonov, AMaloney, DJJohns, MAFu, HJadhav, AVertino, PMYan, QCheng, X Structural Basis for KDM5A Histone Lysine Demethylase Inhibition by Diverse Compounds. Cell Chem Biol23:769-81 (2016) 
 
Lysine-specific demethylase 5A [1-588]
Name:Lysine-specific demethylase 5A [1-588]
Type:Protein
Mol. Mass.:66955.44
Organism:Homo sapiens (Human)
Description:Truncation 1-588 aa. Contains deletion of ARID and PhD1 domains.
Residue:588
BDBM191599
NameBDBM191599
Synonyms:KDOAM-21 | ethyl 2-(((2-((2-(dimethylamino)ethyl)(ethyl)amino)-2-oxoethyl)amino)methyl)isonicotinate (KDM5-C70)
TypeSmall organic molecule
Emp. Form.C17H28N4O3
Mol. Mass.336.4292
SMILESCCOC(=O)c1ccnc(CNCC(=O)N(CC)CCN(C)C)c1