Reaction Details
TargetLysine-specific demethylase 5A [1-588]
LigandBDBM191600
Substrate/Competitorn/a
Meas. Tech.Isothermal Titration Calorimetry (ITC)
Kd 6e+1± 1e+1 nM
Citation Horton, JRLiu, XGale, MWu, LShanks, JRZhang, XWebber, PJBell, JSKales, SCMott, BTRai, GJansen, DJHenderson, MJUrban, DJHall, MDSimeonov, AMaloney, DJJohns, MAFu, HJadhav, AVertino, PMYan, QCheng, X Structural Basis for KDM5A Histone Lysine Demethylase Inhibition by Diverse Compounds. Cell Chem Biol23:769-81 (2016) 
 
Lysine-specific demethylase 5A [1-588]
Name:Lysine-specific demethylase 5A [1-588]
Type:Protein
Mol. Mass.:66955.44
Organism:Homo sapiens (Human)
Description:Truncation 1-588 aa. Contains deletion of ARID and PhD1 domains.
Residue:588
BDBM191600
NameBDBM191600
Synonyms:2-(5-((4-chloro-2-methylbenzyl)oxy)-1Hpyrazol-1-yl)isonicotinic acid (N19) US9604961, Example 89 US9908865, Example 89
TypeSmall organic molecule
Emp. Form.C17H14ClN3O3
Mol. Mass.343.764
SMILESCc1cc(Cl)ccc1COc1ccnn1-c1cc(ccn1)C(O)=O