Reaction Details
TargetLysine-specific demethylase 5B [1-604]
LigandBDBM191601
Substrate/Competitorn/a
Meas. Tech.Isothermal Titration Calorimetry (ITC)
Kd 4.3e+2± 7e+1 nM
Citation Horton, JRLiu, XGale, MWu, LShanks, JRZhang, XWebber, PJBell, JSKales, SCMott, BTRai, GJansen, DJHenderson, MJUrban, DJHall, MDSimeonov, AMaloney, DJJohns, MAFu, HJadhav, AVertino, PMYan, QCheng, X Structural Basis for KDM5A Histone Lysine Demethylase Inhibition by Diverse Compounds. Cell Chem Biol23:769-81 (2016) 
 
Lysine-specific demethylase 5B [1-604]
Name:Lysine-specific demethylase 5B [1-604]
Type:Protein
Mol. Mass.:68980.13
Organism:Homo sapiens (Human)
Description:Truncation 1-604 aa. Contains deletion of ARID and PhD1 domains.
Residue:604
BDBM191601
NameBDBM191601
Synonyms:3-(2-(4-chlorophenyl)acetamido)isonicotinic acid (N16)
TypeSmall organic molecule
Emp. Form.C14H11ClN2O3
Mol. Mass.290.702
SMILESOC(=O)c1ccncc1NC(=O)Cc1ccc(Cl)cc1