Reaction Details
TargetLysine-specific demethylase 5A [1-1090]
LigandBDBM191602
Substrate/Competitorn/a
Meas. Tech.AlphaLISA Assay
pH7.2±n/a
Temperature298.15±n/a K
IC50 7e+2± 1e+2 nM
Commentsextracted
Citation Horton, JRLiu, XGale, MWu, LShanks, JRZhang, XWebber, PJBell, JSKales, SCMott, BTRai, GJansen, DJHenderson, MJUrban, DJHall, MDSimeonov, AMaloney, DJJohns, MAFu, HJadhav, AVertino, PMYan, QCheng, X Structural Basis for KDM5A Histone Lysine Demethylase Inhibition by Diverse Compounds. Cell Chem Biol23:769-81 (2016) 
 
Lysine-specific demethylase 5A [1-1090]
Name:Lysine-specific demethylase 5A [1-1090]
Type:Protein
Mol. Mass.:124246.30
Organism:Homo sapiens (Human)
Description:Truncation 1-1090aa
Residue:1090
BDBM191602
NameBDBM191602
Synonyms:3-((1-methyl-1Hpyrrolo[2,3-b]pyridin-3-yl)amino)isonicotinic acid (N12) US10336727, Example 52 | US9617242, Example 52
TypeSmall organic molecule
Emp. Form.C14H12N4O2
Mol. Mass.268.2707
SMILESCn1cc(Nc2cnccc2C(O)=O)c2cccnc12