Reaction Details
TargetLysine-specific demethylase 5B
LigandBDBM191598
Substrate/Competitorn/a
Meas. Tech.AlphaLISA Assay
pH7.2±n/a
Temperature298.15±n/a K
IC50 30± 5 nM
Commentsextracted
Citation Horton, JRLiu, XGale, MWu, LShanks, JRZhang, XWebber, PJBell, JSKales, SCMott, BTRai, GJansen, DJHenderson, MJUrban, DJHall, MDSimeonov, AMaloney, DJJohns, MAFu, HJadhav, AVertino, PMYan, QCheng, X Structural Basis for KDM5A Histone Lysine Demethylase Inhibition by Diverse Compounds. Cell Chem Biol23:769-81 (2016) 
 
Lysine-specific demethylase 5B
Name:Lysine-specific demethylase 5B
Type:Protein
Mol. Mass.:175659.67
Organism:Homo sapiens (Human)
Description:Q9UGL1
Residue:1544
BDBM191598
NameBDBM191598
Synonyms:2-(((2-((2-(dimethylamino)ethyl)(ethyl)amino)-2-oxoethyl)amino)methyl)isonicotinic acid (KDM5-C49) KDOAM-20
TypeSmall organic molecule
Emp. Form.C15H24N4O3
Mol. Mass.308.3761
SMILESCCN(CCN(C)C)C(=O)CNCc1cc(ccn1)C(O)=O