Reaction Details
TargetTyrosine-protein kinase ITK/TSK
LigandBDBM191606
Substrate/Competitorn/a
Meas. Tech.HotSpot kinase assay
IC50 830±n/a nM
Citation Honigberg, LVerner, EBuggy, JJLoury, DChen, W Inhibitors of bruton's tyrosine kinase US Patent US9181263 Publication Date 11/10/2015
 
Tyrosine-protein kinase ITK/TSK
Name:Tyrosine-protein kinase ITK/TSK
Type:Protein
Mol. Mass.:71839.20
Organism:Homo sapiens (Human)
Description:Q08881
Residue:620
BDBM191606
NameBDBM191606
Synonyms:US9181263, 23 | US9278100, 23
TypeSmall organic molecule
Emp. Form.C22H20N6O2
Mol. Mass.400.4332
SMILESNc1ncnc2n(CCNC(=O)C=C)nc(-c3ccc(Oc4ccccc4)cc3)c12