Reaction Details
TargetTyrosine-protein kinase Lck
LigandBDBM191612
Substrate/Competitorn/a
Meas. Tech.HotSpot kinase assay
IC50 2.6±n/a nM
Citation Honigberg, LVerner, EBuggy, JJLoury, DChen, W Inhibitors of bruton's tyrosine kinase US Patent US9181263 Publication Date 11/10/2015
 
Tyrosine-protein kinase Lck
Name:Tyrosine-protein kinase Lck
Type:n/a
Mol. Mass.:57987.83
Organism:Homo sapiens (Human)
Description:P06239
Residue:509
BDBM191612
NameBDBM191612
Synonyms:US9181263, 7 | US9278100, 7
TypeSmall organic molecule
Emp. Form.C28H31N7O2
Mol. Mass.497.5914
SMILESCN(C)C\C=C\C(=O)N1CCC(CC1)n1nc(-c2ccc(Oc3ccccc3)cc2)c2c(N)ncnc12