Reaction Details
TargetTyrosine-protein kinase Lck
LigandBDBM191614
Substrate/Competitorn/a
Meas. Tech.HotSpot kinase assay
IC50 0.88±n/a nM
Citation Honigberg, LVerner, EBuggy, JJLoury, DChen, W Inhibitors of bruton's tyrosine kinase US Patent US9181263 Publication Date 11/10/2015
 
Tyrosine-protein kinase Lck
Name:Tyrosine-protein kinase Lck
Type:n/a
Mol. Mass.:57987.83
Organism:Homo sapiens (Human)
Description:P06239
Residue:509
BDBM191614
NameBDBM191614
Synonyms:US9181263, 10 | US9278100, 10
TypeSmall organic molecule
Emp. Form.C26H26N6O2
Mol. Mass.454.5236
SMILESNc1ncnc2n(nc(-c3ccc(Oc4ccccc4)cc3)c12)[C@H]1CC[C@@H](CC1)NC(=O)C=C