Reaction Details
TargetSerine protease hepsin
LigandBDBM191630
Substrate/Competitorn/a
Meas. Tech.High-Throughput Screening Assay
IC50 1930±390 nM
Citation Vasioukhin, VIChevillet, JR Hepsin inhibitors US Patent US9182402 Publication Date 11/10/2015
 
Serine protease hepsin
Name:Serine protease hepsin
Type:Enzyme
Mol. Mass.:45016.98
Organism:Homo sapiens (Human)
Description:Human deglycosylated hepsin was expressed in Pichia pastoris.
Residue:417
BDBM191630
NameBDBM191630
Synonyms:US9182402, 3
TypeSmall organic molecule
Emp. Form.C19H12BrN3O3
Mol. Mass.410.221
SMILESBrc1cccc(c1)N1C(=O)NC(=O)\C(=C/c2c[nH]c3ccccc23)C1=O