Reaction Details
TargetSerine protease hepsin
LigandBDBM191631
Substrate/Competitorn/a
Meas. Tech.High-Throughput Screening Assay
IC50 570±190 nM
Citation Vasioukhin, VIChevillet, JR Hepsin inhibitors US Patent US9182402 Publication Date 11/10/2015
 
Serine protease hepsin
Name:Serine protease hepsin
Type:Enzyme
Mol. Mass.:45016.98
Organism:Homo sapiens (Human)
Description:Human deglycosylated hepsin was expressed in Pichia pastoris.
Residue:417
BDBM191631
NameBDBM191631
Synonyms:US9182402, 5
TypeSmall organic molecule
Emp. Form.C19H15F3N2O2
Mol. Mass.360.3298
SMILES[O-][N+](=O)c1ccc(cc1)C1Nc2c(cccc2C(F)(F)F)C2C=CCC12