Reaction Details
TargetSerine protease hepsin
LigandBDBM191634
Substrate/Competitorn/a
Meas. Tech.High-Throughput Screening Assay
IC50 2310±530 nM
Citation Vasioukhin, VIChevillet, JR Hepsin inhibitors US Patent US9182402 Publication Date 11/10/2015
 
Serine protease hepsin
Name:Serine protease hepsin
Type:Enzyme
Mol. Mass.:45016.98
Organism:Homo sapiens (Human)
Description:Human deglycosylated hepsin was expressed in Pichia pastoris.
Residue:417
BDBM191634
NameBDBM191634
Synonyms:US9182402, 7
TypeSmall organic molecule
Emp. Form.C29H16F2N2O4
Mol. Mass.494.4451
SMILESFc1cccc(c1)-c1nc2ccc(Cc3ccc4nc(oc(=O)c4c3)-c3cccc(F)c3)cc2c(=O)o1