Reaction Details
TargetSerine protease hepsin
LigandBDBM191637
Substrate/Competitorn/a
Meas. Tech.High-Throughput Screening Assay
IC50 930±130 nM
Citation Vasioukhin, VIChevillet, JR Hepsin inhibitors US Patent US9182402 Publication Date 11/10/2015
 
Serine protease hepsin
Name:Serine protease hepsin
Type:Enzyme
Mol. Mass.:45016.98
Organism:Homo sapiens (Human)
Description:Human deglycosylated hepsin was expressed in Pichia pastoris.
Residue:417
BDBM191637
NameBDBM191637
Synonyms:US9182402, 10
TypeSmall organic molecule
Emp. Form.C20H18BrNO4S
Mol. Mass.448.33
SMILESCC1(C)Cc2oc3c(Br)cc(NS(=O)(=O)c4ccccc4)cc3c2C(=O)C1