Reaction Details
TargetTrypsin
LigandBDBM191630
Substrate/Competitorn/a
Meas. Tech.High-Throughput Screening Assay
IC50 7630±1510 nM
Citation Vasioukhin, VIChevillet, JR Hepsin inhibitors US Patent US9182402 Publication Date 11/10/2015
 
Trypsin
Name:Trypsin
Synonyms:TRYP_PIG
Type:PROTEIN
Mol. Mass.:24411.24
Organism:Sus scrofa
Description:ChEMBL_1450738
Residue:231
BDBM191630
NameBDBM191630
Synonyms:US9182402, 3
TypeSmall organic molecule
Emp. Form.C19H12BrN3O3
Mol. Mass.410.221
SMILESBrc1cccc(c1)N1C(=O)NC(=O)\C(=C/c2c[nH]c3ccccc23)C1=O