Reaction Details
TargetTrypsin
LigandBDBM191633
Substrate/Competitorn/a
Meas. Tech.High-Throughput Screening Assay
IC50 10200±1500 nM
Citation Vasioukhin, VIChevillet, JR Hepsin inhibitors US Patent US9182402 Publication Date 11/10/2015
 
Trypsin
Name:Trypsin
Synonyms:TRYP_PIG
Type:PROTEIN
Mol. Mass.:24411.24
Organism:Sus scrofa
Description:ChEMBL_1450738
Residue:231
BDBM191633
NameBDBM191633
Synonyms:US9182402, 6
TypeSmall organic molecule
Emp. Form.C18H15ClN2O2
Mol. Mass.326.777
SMILES[O-][N+](=O)c1cccc(c1)C1Nc2ccc(Cl)cc2C2C=CCC12