Reaction Details
TargetTrypsin
LigandBDBM50013876
Substrate/Competitorn/a
Meas. Tech.High-Throughput Screening Assay
IC50 2420±290 nM
Citation Vasioukhin, VIChevillet, JR Hepsin inhibitors US Patent US9182402 Publication Date 11/10/2015
 
Trypsin
Name:Trypsin
Synonyms:TRYP_PIG
Type:PROTEIN
Mol. Mass.:24411.24
Organism:Sus scrofa
Description:ChEMBL_1450738
Residue:231
BDBM50013876
NameBDBM50013876
TypeSmall organic molecule
Emp. Form.C5H9NO4
Mol. Mass.147.1293
SMILESCN[C@H](CC(O)=O)C(O)=O