Reaction Details
TargetProthrombin
LigandBDBM191630
Substrate/Competitorn/a
Meas. Tech.High-Throughput Screening Assay
IC50>20000±n/a nM
Citation Vasioukhin, VIChevillet, JR Hepsin inhibitors US Patent US9182402 Publication Date 11/10/2015
 
Prothrombin
Name:Prothrombin
Type:Enzyme
Mol. Mass.:70502.73
Organism:Bos taurus (Bovine)
Description:P00735
Residue:625
BDBM191630
NameBDBM191630
Synonyms:US9182402, 3
TypeSmall organic molecule
Emp. Form.C19H12BrN3O3
Mol. Mass.410.221
SMILESBrc1cccc(c1)N1C(=O)NC(=O)\C(=C/c2c[nH]c3ccccc23)C1=O