Reaction Details
TargetProthrombin
LigandBDBM191631
Substrate/Competitorn/a
Meas. Tech.High-Throughput Screening Assay
IC50>20000±n/a nM
Citation Vasioukhin, VIChevillet, JR Hepsin inhibitors US Patent US9182402 Publication Date 11/10/2015
 
Prothrombin
Name:Prothrombin
Type:Enzyme
Mol. Mass.:70502.73
Organism:Bos taurus (Bovine)
Description:P00735
Residue:625
BDBM191631
NameBDBM191631
Synonyms:US9182402, 5
TypeSmall organic molecule
Emp. Form.C19H15F3N2O2
Mol. Mass.360.3298
SMILES[O-][N+](=O)c1ccc(cc1)C1Nc2c(cccc2C(F)(F)F)C2C=CCC12