Reaction Details
TargetProthrombin
LigandBDBM191635
Substrate/Competitorn/a
Meas. Tech.High-Throughput Screening Assay
IC50>20000±n/a nM
Citation Vasioukhin, VIChevillet, JR Hepsin inhibitors US Patent US9182402 Publication Date 11/10/2015
 
Prothrombin
Name:Prothrombin
Type:Enzyme
Mol. Mass.:70502.73
Organism:Bos taurus (Bovine)
Description:P00735
Residue:625
BDBM191635
NameBDBM191635
Synonyms:US9182402, 8
TypeSmall organic molecule
Emp. Form.C15H9BrCl2N4OS
Mol. Mass.444.133
SMILESClc1ccc(NC(=O)Nc2nnc(s2)-c2ccc(Br)cc2)cc1Cl