Reaction Details
TargetProthrombin
LigandBDBM50007260
Substrate/Competitorn/a
Meas. Tech.High-Throughput Screening Assay
IC50>20000±n/a nM
Citation Vasioukhin, VIChevillet, JR Hepsin inhibitors US Patent US9182402 Publication Date 11/10/2015
 
Prothrombin
Name:Prothrombin
Type:Enzyme
Mol. Mass.:70502.73
Organism:Bos taurus (Bovine)
Description:P00735
Residue:625
BDBM50007260
NameBDBM50007260
Synonyms:2,6-Di-tert-butyl-4-[1-(3,5-di-tert-butyl-4-hydroxy-phenylsulfanyl)-1-methyl-ethylsulfanyl]-phenol 2,6-di(tert-butyl)-4-{1-[3,5-di(tert-butyl)-4-hydroxyphenylsulfanyl]-1-methylethylsulfanyl}phenol(probucol) CHEMBL608 Lorelco US9182402, 14
TypeSmall organic molecule
Emp. Form.C31H48O2S2
Mol. Mass.516.842
SMILESCC(C)(Sc1cc(c(O)c(c1)C(C)(C)C)C(C)(C)C)Sc1cc(c(O)c(c1)C(C)(C)C)C(C)(C)C