Reaction Details
TargetNeutrophil collagenase
LigandBDBM50092158
Substrate/Competitorn/a
Meas. Tech.In vitro MMP-8 Assay
Temperature310.15±n/a K
IC50 35000±n/a nM
Commentsextracted
Citation Johnson, FGolub, L Curcumin analogues as zinc chelators and their uses US Patent US9187406 Publication Date 11/17/2015
 
Neutrophil collagenase
Name:Neutrophil collagenase
Type:Enzyme
Mol. Mass.:53413.48
Organism:Homo sapiens (Human)
Description:P22894
Residue:467
BDBM50092158
NameBDBM50092158
Synonyms:1,10-phenanthroline US10669227, Compound 1,10-phenanthroline US9187406, 1,10-phenanthroline | cid_1318
TypeSmall organic molecule
Emp. Form.C12H8N2
Mol. Mass.180.2053
SMILESc1cnc2c(c1)ccc1cccnc21