Reaction Details
TargetCytochrome b
LigandBDBM192008
Substrate/Competitorn/a
Meas. Tech.Cytochrome b Enzyme Assay
pH7.4±n/a
Temperature298.15±n/a K
IC50 5±n/a nM
Commentsextracted
Citation Vincent, BMLanglois, JBSrinivas, RLancaster, AKScherz-Shouval, RWhitesell, LTidor, BBuchwald, SLLindquist, S A Fungal-Selective Cytochrome bc1 Inhibitor Impairs Virulence and Prevents the Evolution of Drug Resistance. Cell Chem Biol23:978-991 (2016) 
 
Cytochrome b
Name:Cytochrome b
Synonyms:n/a
Type:Protein
Mol. Mass.:43717.83
Organism:Candida albicans (Yeast)
Description:n/a
Residue:387
BDBM192008
NameBDBM192008
TypeSmall organic molecule
Emp. Form.C28H40N2O9
Mol. Mass.548.6252
SMILESCCCCCCC1[C@@H](OC(=O)CC(C)C)[C@H](C)OC(=O)[C@@H](NC(=O)c2cccc(NC=O)c2O)[C@@H](C)OC1=O