Reaction Details
TargetCytochrome b
LigandBDBM192077
Substrate/Competitorn/a
Meas. Tech.Cytochrome b Enzyme Assay
pH7.4±n/a
Temperature298.15±n/a K
IC50 35.16±n/a nM
Commentsextracted
Citation Vincent, BMLanglois, JBSrinivas, RLancaster, AKScherz-Shouval, RWhitesell, LTidor, BBuchwald, SLLindquist, S A Fungal-Selective Cytochrome bc1 Inhibitor Impairs Virulence and Prevents the Evolution of Drug Resistance. Cell Chem Biol23:978-991 (2016) 
 
Cytochrome b
Name:Cytochrome b
Synonyms:n/a
Type:Protein
Mol. Mass.:43717.83
Organism:Candida albicans (Yeast)
Description:n/a
Residue:387
BDBM192077
NameBDBM192077
Synonyms:Inz-68
TypeSmall organic molecule
Emp. Form.C23H19FN2O3
Mol. Mass.390.407
SMILESCOC(=O)Cn1nc(-c2cc(OCc3ccccc3)ccc2F)c2ccccc12