Reaction Details
TargetE3 ubiquitin-protein ligase Mdm2
LigandBDBM192151
Substrate/Competitorn/a
Meas. Tech.Fluorescence Polarization (FP) Assay
Temperature293.15±n/a K
Ki 0.81±n/a nM
Commentsextracted
Citation Doemling, A p53-Mdm2 antagonists US Patent US9187441 Publication Date 11/17/2015
 
E3 ubiquitin-protein ligase Mdm2
Name:E3 ubiquitin-protein ligase Mdm2
Type:Oncoprotein
Mol. Mass.:55196.54
Organism:Homo sapiens (Human)
Description:Q00987
Residue:491
BDBM192151
NameBDBM192151
Synonyms:US9187441, 7C
TypeSmall organic molecule
Emp. Form.C31H38ClN3O6
Mol. Mass.584.103
SMILESCCOC(=O)c1c(C(N(CC(C)C)C(C)=O)C(=O)NCc2ccccc2)c2ccc(Cl)cc2n1C(=O)OC(C)(C)C