Reaction Details
TargetCholesteryl ester transfer protein
LigandBDBM192306
Substrate/Competitorn/a
Meas. Tech.CETP Inhibition Assay
Temperature310.15±n/a K
IC50 6±n/a nM
Commentsextracted
Citation Nakamura, TNamiki, HTerasaka, NShima, AHagihara, MIwase, NTakata, KKikuchi, OTsuboike, KSetoguchi, HYoneda, KSunamoto, HIto, K Substituted pyridine compound US Patent US9187450 Publication Date 11/17/2015
 
Cholesteryl ester transfer protein
Name:Cholesteryl ester transfer protein
Type:Enzyme
Mol. Mass.:54751.53
Organism:Homo sapiens (Human)
Description:P11597
Residue:493
BDBM192306
NameBDBM192306
Synonyms:US9187450, 52
TypeSmall organic molecule
Emp. Form.C39H49F6N5O3S
Mol. Mass.781.893
SMILESCC(C)S(=O)(=O)N(C)Cc1cnc(nc1)N1CCC(CC1)c1nc2CC(C)(C)C[C@H](O)c2c(C2CCC(F)(F)CC2)c1[C@@H](F)c1ccc(cc1)C(F)(F)F