Reaction Details
TargetMitogen-activated protein kinase 1 [8-360]
LigandBDBM192367
Substrate/Competitorn/a
Meas. Tech.Enzymatic Assay
pH7.3±n/a
IC50 1.4±n/a nM
Commentsextracted
Citation Blake, JFChen, HChicarelli, MJDemeese, JGarrey, RFGaudino, JGazzard, LKaus, RJKintz, SMohr, PJMoreno, DASchwarz, JSiedem, CSWallace, EM Substituted quinazolines as serine/threonine kinase inhibitors US Patent US9187462 Publication Date 11/17/2015
 
Mitogen-activated protein kinase 1 [8-360]
Name:Mitogen-activated protein kinase 1 [8-360]
Type:n/a
Mol. Mass.:40835.09
Organism:Homo sapiens (Human)
Description:P28482 aa 8-360
Residue:353
BDBM192367
NameBDBM192367
Synonyms:US9187462, I-47
TypeSmall organic molecule
Emp. Form.C26H26ClFN6O3
Mol. Mass.524.974
SMILESCn1cc(cn1)[C@@H](NC(=O)c1ccc2cnc(N[C@@H]3CCO[C@H](CO)C3)nc2c1)c1ccc(Cl)c(F)c1