Reaction Details
TargetMitogen-activated protein kinase 1 [8-360]
LigandBDBM192388
Substrate/Competitorn/a
Meas. Tech.Enzymatic Assay
pH7.3±n/a
IC50 1.2±n/a nM
Commentsextracted
Citation Blake, JFChen, HChicarelli, MJDemeese, JGarrey, RFGaudino, JGazzard, LKaus, RJKintz, SMohr, PJMoreno, DASchwarz, JSiedem, CSWallace, EM Substituted quinazolines as serine/threonine kinase inhibitors US Patent US9187462 Publication Date 11/17/2015
 
Mitogen-activated protein kinase 1 [8-360]
Name:Mitogen-activated protein kinase 1 [8-360]
Type:n/a
Mol. Mass.:40835.09
Organism:Homo sapiens (Human)
Description:P28482 aa 8-360
Residue:353
BDBM192388
NameBDBM192388
Synonyms:BDBM192402 | US9187462, I-68
TypeSmall organic molecule
Emp. Form.C25H24F2N6O2
Mol. Mass.478.4939
SMILESCn1cc(cn1)[C@@H](NC(=O)c1cc(F)c2cnc(NC3CCOCC3)nc2c1)c1cccc(F)c1