Reaction Details
TargetMitogen-activated protein kinase 1 [8-360]
LigandBDBM192403
Substrate/Competitorn/a
Meas. Tech.Enzymatic Assay
pH7.3±n/a
IC50 1.2±n/a nM
Commentsextracted
Citation Blake, JFChen, HChicarelli, MJDemeese, JGarrey, RFGaudino, JGazzard, LKaus, RJKintz, SMohr, PJMoreno, DASchwarz, JSiedem, CSWallace, EM Substituted quinazolines as serine/threonine kinase inhibitors US Patent US9187462 Publication Date 11/17/2015
 
Mitogen-activated protein kinase 1 [8-360]
Name:Mitogen-activated protein kinase 1 [8-360]
Type:n/a
Mol. Mass.:40835.09
Organism:Homo sapiens (Human)
Description:P28482 aa 8-360
Residue:353
BDBM192403
NameBDBM192403
Synonyms:US9187462, II-13
TypeSmall organic molecule
Emp. Form.C27H28F2N6O3
Mol. Mass.522.5464
SMILESCOc1ccc(cc1F)[C@H](NC(=O)c1cc(F)c2cnc(N[C@H]3CC[C@H](O)CC3)nc2c1)c1cnn(C)c1