Reaction Details
TargetMitogen-activated protein kinase 1 [8-360]
LigandBDBM192437
Substrate/Competitorn/a
Meas. Tech.Enzymatic Assay
pH7.3±n/a
IC50 1.3±n/a nM
Commentsextracted
Citation Blake, JFChen, HChicarelli, MJDemeese, JGarrey, RFGaudino, JGazzard, LKaus, RJKintz, SMohr, PJMoreno, DASchwarz, JSiedem, CSWallace, EM Substituted quinazolines as serine/threonine kinase inhibitors US Patent US9187462 Publication Date 11/17/2015
 
Mitogen-activated protein kinase 1 [8-360]
Name:Mitogen-activated protein kinase 1 [8-360]
Type:n/a
Mol. Mass.:40835.09
Organism:Homo sapiens (Human)
Description:P28482 aa 8-360
Residue:353
BDBM192437
NameBDBM192437
Synonyms:US9187462, II-47
TypeSmall organic molecule
Emp. Form.C25H23F2N5O4
Mol. Mass.495.478
SMILESCOc1ccc(cc1F)[C@H](NC(=O)c1cc(F)c2cnc(NC3CCOCC3)nc2c1)c1cnco1