Reaction Details
TargetMitogen-activated protein kinase 13
LigandBDBM192498
Substrate/Competitorn/a
Meas. Tech.Immobilized Metal Affinity Polarization (IMAP) Assay
Temperature298.15±n/a K
IC50 27.54±n/a nM
Commentsextracted
Citation Holtzman, MRomero, AAlevy, YPatel, ABrett, TPatel, D Anti-mucus drugs and uses therefor US Patent US9187470 Publication Date 11/17/2015
 
Mitogen-activated protein kinase 13
Name:Mitogen-activated protein kinase 13
Type:Enzyme
Mol. Mass.:42097.16
Organism:Homo sapiens (Human)
Description:O15264
Residue:365
BDBM192498
NameBDBM192498
Synonyms:US9187470, 89
TypeSmall organic molecule
Emp. Form.C24H32N6O2S
Mol. Mass.468.615
SMILESCc1ccc(cc1)-n1nc(cc1NC(=O)Nc1ncc(CCN2CCOCC2)s1)C(C)(C)C