Reaction Details
TargetSerine/threonine-protein kinase A-Raf
LigandBDBM192504
Substrate/Competitorn/a
Meas. Tech.KiNativ assay
IC50 120±n/a nM
Citation Flynn, DLKaufman, MDVogeti, LWise, SLu, WSmith, BCaldwell, TMPatt, WCHenry, JRHipskind, PAPeng, S Raf inhibitor compounds US Patent US9187474 Publication Date 11/17/2015
 
Serine/threonine-protein kinase A-Raf
Name:Serine/threonine-protein kinase A-Raf
Type:Enzyme
Mol. Mass.:67610.81
Organism:Homo sapiens (Human)
Description:P10398
Residue:606
BDBM192504
NameBDBM192504
Synonyms:US9187474, 76
TypeSmall organic molecule
Emp. Form.C23H27F2N5O
Mol. Mass.427.4902
SMILESCNc1cc2nc(C)c(cc2cn1)-c1cc(NC(=O)NCCC(C)(C)F)c(F)cc1C