Reaction Details
TargetCannabinoid receptor 1
LigandBDBM192528
Substrate/Competitorn/a
Meas. Tech.Radioligand Displacement Assay (CP55940)
Ki 4.08±n/a nM
Citation Maitra, RFulp, ABZhang, YSeltzman, HH Peripherally restricted diphenyl purine derivatives US Patent US9187480 Publication Date 11/17/2015
 
Cannabinoid receptor 1
Name:Cannabinoid receptor 1
Type:G Protein-Coupled Receptor (GPCR)
Mol. Mass.:52868.96
Organism:Homo sapiens (Human)
Description:P21554
Residue:472
BDBM192528
NameBDBM192528
Synonyms:US9187480, N-tert-butyl-1-[8-(2-chlorophenyl)-9-(4-chlorophenyl)-9H-purin-6-yl]-4-phenylpiperidine-4-carboxamide
TypeSmall organic molecule
Emp. Form.C33H32Cl2N6O
Mol. Mass.599.553
SMILESCC(C)(C)NC(=O)C1(CCN(CC1)c1ncnc2n(c(nc12)-c1ccccc1Cl)-c1ccc(Cl)cc1)c1ccccc1