Reaction Details
TargetCannabinoid receptor 1
LigandBDBM50399525
Substrate/Competitorn/a
Meas. Tech.Radioligand Displacement Assay (CP55940)
Ki 23.91±n/a nM
Citation Maitra, RFulp, ABZhang, YSeltzman, HH Peripherally restricted diphenyl purine derivatives US Patent US9187480 Publication Date 11/17/2015
 
Cannabinoid receptor 1
Name:Cannabinoid receptor 1
Type:G Protein-Coupled Receptor (GPCR)
Mol. Mass.:52868.96
Organism:Homo sapiens (Human)
Description:P21554
Residue:472
BDBM50399525
NameBDBM50399525
Synonyms:CHEMBL2180226 | US9187480, tert-butyl 4-{[8-(2-chlorophenyl)-9-(4-chlorophenyl)-9H-purin-6-yl]amino}piperidine-1-carboxylate
TypeSmall organic molecule
Emp. Form.C27H28Cl2N6O2
Mol. Mass.539.456
SMILESCC(C)(C)OC(=O)N1CCC(CC1)Nc1ncnc2n(c(nc12)-c1ccccc1Cl)-c1ccc(Cl)cc1