Reaction Details
TargetCannabinoid receptor 1
LigandBDBM192530
Substrate/Competitorn/a
Meas. Tech.Radioligand Displacement Assay (CP55940)
Ki 2.55±n/a nM
Citation Maitra, RFulp, ABZhang, YSeltzman, HH Peripherally restricted diphenyl purine derivatives US Patent US9187480 Publication Date 11/17/2015
 
Cannabinoid receptor 1
Name:Cannabinoid receptor 1
Type:G Protein-Coupled Receptor (GPCR)
Mol. Mass.:52868.96
Organism:Homo sapiens (Human)
Description:P21554
Residue:472
BDBM192530
NameBDBM192530
Synonyms:US9187480, N-{1-[8-(2-chlorophenyl)-9-(4-chlorophenyl)-9H-purin-6-yl]piperidin-4-yl}benzamide
TypeSmall organic molecule
Emp. Form.C29H24Cl2N6O
Mol. Mass.543.446
SMILESClc1ccc(cc1)-n1c(nc2c(ncnc12)N1CCC(CC1)NC(=O)c1ccccc1)-c1ccccc1Cl