Reaction Details
TargetCannabinoid receptor 1
LigandBDBM192534
Substrate/Competitorn/a
Meas. Tech.Radioligand Displacement Assay (CP55940)
Ki 1.93±n/a nM
Citation Maitra, RFulp, ABZhang, YSeltzman, HH Peripherally restricted diphenyl purine derivatives US Patent US9187480 Publication Date 11/17/2015
 
Cannabinoid receptor 1
Name:Cannabinoid receptor 1
Type:G Protein-Coupled Receptor (GPCR)
Mol. Mass.:52868.96
Organism:Homo sapiens (Human)
Description:P21554
Residue:472
BDBM192534
NameBDBM192534
Synonyms:US9187480, N-{1-[8-(2-chlorophenyl)-9-(4-chlorophenyl)-9H-purin-6-yl]piperidin-4-yl}-2-cyclohexylacetamide
TypeSmall organic molecule
Emp. Form.C30H32Cl2N6O
Mol. Mass.563.521
SMILESClc1ccc(cc1)-n1c(nc2c(ncnc12)N1CCC(CC1)NC(=O)CC1CCCCC1)-c1ccccc1Cl